{"text_format":"1","workbook":"xlsx","n_sheets":9,"sheets":["Introduction","Inputs","Assumptions","Calculations","Results","Scenario analysis","Coega","East London","Richards Bay"],"not_rendered":{"charts":10,"images":2,"macros":1,"external_links":0,"defined_names":4,"comments":3,"pivot_tables":0},"unopened":[],"bounds":{"document_bytes":16777216,"sheet_cells":100000,"rows_first":2000,"rows_last":500,"rows_between":2000,"halvings":0,"cell_chars":16384,"cell_head_chars":4096},"cells_cut":0,"cells_raw":0,"read":"whole","date_system":"1900"}

{"sheet":"Introduction","index":0,"n_rows":15,"n_cols":3,"rows_kept":15,"cut":false,"hidden":false,"merged":[[12,1,12,2],[7,1,7,2],[5,1,5,2],[3,1,3,2],[1,1,1,2],[2,1,2,2]]}
[]
[null,"This model provides a tool to assess the likely total public cost of setting up and operating an IDZ."]
[null,"Cells or text shaded in blue indicate data and information which can be edited or changed by the user."]
[null,"The model is divided into two parts."]
[]
[null,"1. Setting up a new IDZ"]
[null,"Key assumptions","The model assumes that the IDZ is set-up (installation of bulk infrastructure) over a period of the first five years (Year 1 to Year 5).\nTenants and investors then begin investing within the IDZ between Year 6 and Year 20 (a 15 year period)."]
[null,"The following worksheets are used to determine the cost of setting up a new IDZ:"]
[null,"Inputs worksheet","This worksheet provides the user with the ability to set up the IDZ based on the number of tenants and average size of the tenants.\nOnce the potential size of the IDZ has been determined, the user can then input the expected utilization of the IDZ by inputting the actual number of tenants secured within the IDZ.\nThe user can determine how much cofunding is provided by the IDZ, the average level of incentives provided to the tenants and the tenants likely investment stream.\nFinally the user can enter an expected rental income rate for each type of tenant."]
[null,"Assumptions worksheet","This worksheet provides a summary of the key assumptions used in the model. \nBaseline values are provided based on a review of existing IDZs, though users are able to alter these assumptions as more and better information becomes available."]
[null,"Results worksheet","The results worksheet provides a summary analysis of the new IDZ based on the information from the Input and Assumptions worksheets. \nPublic funding requirements are split into funding required for setting up the IDZ, cofunding of investors (CAPEX cofunding) and funding required to support the IDZ in periods where it experiences an operational shortfall.\nResults on the total value of private investment, export value and job creation are also provided."]
[]
[null,"2. Scenario analysis of existing IDZs"]
[null,"Assumptions","The scenario analysis tool provides an assessment of existing IDZs based on actual and forecast information. \nYears 1 - 5 is \"actual data\" based on information from the annual reports of the IDZs for the period 2008/9 to 2012/13.\nYears 6 - 20 provide a forecast based on a number of assumptions for the baseline scenario:\n-Rental income is R100/sqm.\n-No further bulk infrastructure is added to the IDZ."]
[null,"Scenario analysis worksheet","Users are able to select between the IDZs and between two breakeven options:\n-Achieving operational breakeven through an increase in the average (R/sqm) rental income or\n-Achieving operational breakeven through a reduction in OPEX.\nThe breakeven point is achieved by year 20.\nUsers are also able to select the proportion of remaining lettable area that is leased to tenants by year 20.\nAdditional assumptions for each IDZ for the years 6 - 20 are provided including:\n-The average level of cofunding (the % of IDZ funding as a proportion of the total investment in non-bulk CAPEX).\n-The average level of jobs created per each R1 million of private (tenant) investment."]
{"$rows_left_out":1}
{"sheet":"Inputs","index":1,"n_rows":78,"n_cols":8,"rows_kept":78,"cut":false,"hidden":false,"merged":[[0,0,0,9],[5,0,6,16383],[36,0,37,16383],[80,0,81,16383],[1,0,3,9]]}
[]
["IDZ costing"]
[]
[]
[]
["Design and set up the IDZ"]
[]
[]
["What is the expected number of tenants in the IDZ?"]
[]
[null,null,null,"No. of tenants",null,null,"Average lettable size of tenant (sqm)"]
[null,null,"Anchor",10,null,"Anchor","Baseline",{"$f":"IF(G12=\"Baseline\",Assumptions!D13,\"\")","v":500000}]
[null,null,"Medium",100,null,"Medium","Baseline",{"$f":"IF(G13=\"Baseline\",Assumptions!D14,\"\")","v":25000}]
[null,null,"Small",100,null,"Small","Baseline",{"$f":"IF(G14=\"Baseline\",Assumptions!D15,\"\")","v":5000}]
[]
{"$rows_left_out":64}
{"sheet":"Assumptions","index":2,"n_rows":65,"n_cols":8,"rows_kept":65,"cut":false,"hidden":false,"merged":[[1,0,3,8]]}
[]
["Model Assumptions"]
[]
[]
[]
[null,"The model assumes that the IDZ is set-up (installation of bulk infrastructure) over a period of the first five years (Year 1 to Year 5)"]
[null,"Tenants and investors then begin investing within the IDZ between Year 6 and Year 20 (a 15 year period)"]
[]
[]
[]
[null,"Baseline tenants"]
[null,"Tenant data","Average jobs created per R million private investment","Average size (sqm)","Tenant Investment","IDZ investment","Rental income (per sqm)","Annual exports (Rands)"]
[null,"Anchor",3,500000,1000000000,{"$f":"E13*0.25","v":250000000},100,10000000]
[null,"Medium",3,25000,100000000,{"$f":"E14*0.5","v":50000000},100,2000000]
[null,"Small",3,5000,25000000,{"$f":"E15*1","v":25000000},100,200000]
{"$rows_left_out":51}
{"sheet":"Calculations","index":3,"n_rows":88,"n_cols":23,"rows_kept":88,"cut":false,"hidden":true,"merged":[]}
[]
[null,"Tenant data","Average tenant size (sqm)","Total letable area (sqm)",null,"Gross IDZ size (sqm)","Total size (sqm)","Bulk cost","Land cost","Total set up cost"]
[null,"Anchor",{"$f":"IF(Inputs!G12=\"Baseline\",Assumptions!D13,Inputs!G12)","v":500000},{"$f":"C3*Inputs!D12","v":5000000},null,"Anchor",{"$f":"Calculations!C3*Inputs!D12/Assumptions!$C$19","v":8333333.333333334},{"$f":"IF(Inputs!$G$18=\"Baseline\",Assumptions!$C$22*Calculations!G3,Calculations!G3*Inputs!$G$18)","v":833333333.33333337},{"$f":"IF(Inputs!$G$28=\"High\",Assumptions!$C$28*Calculations!G3,IF(Inputs!$G$28=\"Low\",Assumptions!$C$29*Calculations!G3,0))","v":833333333.33333337},{"$f":"H3+I3","v":1666666666.6666667}]
[null,"Medium",{"$f":"IF(Inputs!G13=\"Baseline\",Assumptions!D14,Inputs!G13)","v":25000},{"$f":"C4*Inputs!D13","v":2500000},null,"Medium",{"$f":"Calculations!C4*Inputs!D13/Assumptions!$C$19","v":4166666.666666667},{"$f":"IF(Inputs!$G$18=\"Baseline\",Assumptions!$C$22*Calculations!G4,Calculations!G4*Inputs!$G$18)","v":416666666.66666669},{"$f":"IF(Inputs!$G$28=\"High\",Assumptions!$C$28*Calculations!G4,IF(Inputs!$G$28=\"Low\",Assumptions!$C$29*Calculations!G4,0))","v":416666666.66666669},{"$f":"H4+I4","v":833333333.33333337}]
[null,"Small",{"$f":"IF(Inputs!G14=\"Baseline\",Assumptions!D15,Inputs!G14)","v":5000},{"$f":"C5*Inputs!D14","v":500000},null,"Small",{"$f":"Calculations!C5*Inputs!D14/Assumptions!$C$19","v":833333.33333333337},{"$f":"IF(Inputs!$G$18=\"Baseline\",Assumptions!$C$22*Calculations!G5,Calculations!G5*Inputs!$G$18)","v":83333333.333333343},{"$f":"IF(Inputs!$G$28=\"High\",Assumptions!$C$28*Calculations!G5,IF(Inputs!$G$28=\"Low\",Assumptions!$C$29*Calculations!G5,0))","v":83333333.333333343},{"$f":"H5+I5","v":166666666.66666669}]
[null,"Total",null,{"$f":"SUM(D3:D5)","v":8000000},null,"Total",{"$f":"SUM(G3:G5)","v":13333333.333333334},{"$f":"SUM(H3:H5)","v":1333333333.3333333},{"$f":"IF(Inputs!$G$23=\"Donated\",0,IF(AND(ISNUMBER(Inputs!$G$28),Inputs!$G$23=\"Purchased\"),Inputs!$G$28,SUM(I3:I5)))","v":0},{"$f":"I6+H6","v":1333333333.3333333}]
[]
[]
[null,"Actual number of tenants on IDZ","Actual tenants","Actual average size (sqm)","Total area leased (sqm)","Tenant investment","IDZ investment","Total investment","Rental income","Jobs created","Total incentives provided annually","Annual exports"]
[null,"Anchor",{"$f":"Inputs!D43","v":0},{"$f":"IF(Inputs!G43=\"Baseline\",Calculations!C3,Inputs!G43)","v":500000},{"$f":"D10*C10","v":0},{"$f":"IF(Inputs!D53=\"Baseline\",Assumptions!E13*C10,Inputs!D53*C10)","v":0},{"$f":"IF(Inputs!G53=\"Baseline\",Assumptions!F13*C10,Inputs!G53)","v":0},{"$f":"F10+G10","v":0},{"$f":"IF(Inputs!G76=\"Baseline\",Assumptions!G13*Calculations!E10,Inputs!G76*Calculations!E10)","v":0},{"$f":"(F10/1000000)*Assumptions!C13","v":0},{"$f":"C10*Inputs!D62","v":0},{"$f":"C10*Assumptions!H13","v":0}]
[null,"Medium",{"$f":"Inputs!D44","v":2},{"$f":"IF(Inputs!G44=\"Baseline\",Calculations!C4,Inputs!G44)","v":25000},{"$f":"D11*C11","v":50000},{"$f":"IF(Inputs!D54=\"Baseline\",Assumptions!E14*C11,Inputs!D54*C11)","v":200000000},{"$f":"IF(Inputs!G54=\"Baseline\",Assumptions!F14*C11,Inputs!G54)","v":100000000},{"$f":"F11+G11","v":300000000},{"$f":"IF(Inputs!G77=\"Baseline\",Assumptions!G14*Calculations!E11,Inputs!G77*Calculations!E11)","v":5000000},{"$f":"(F11/1000000)*Assumptions!C14","v":600},{"$f":"C11*Inputs!D63","v":0},{"$f":"C11*Assumptions!H14","v":4000000}]
[null,"Small",{"$f":"Inputs!D45","v":19},{"$f":"IF(Inputs!G45=\"Baseline\",Calculations!C5,Inputs!G45)","v":5000},95000,{"$f":"IF(Inputs!D55=\"Baseline\",Assumptions!E15*C12,Inputs!D55*C12)","v":475000000},{"$f":"IF(Inputs!G55=\"Baseline\",Assumptions!F15*C12,Inputs!G55)","v":475000000},{"$f":"F12+G12","v":950000000},{"$f":"IF(Inputs!G78=\"Baseline\",Assumptions!G15*Calculations!E12,Inputs!G78*Calculations!E12)","v":9500000},{"$f":"(F12/1000000)*Assumptions!C15","v":1425},{"$f":"C12*Inputs!D64","v":0},{"$f":"C12*Assumptions!H15","v":3800000}]
[null,"Total",null,null,{"$f":"SUM(E10:E12)","v":145000},675000000,575000000,1250000000,14500000,2025,{"$f":"SUM(K10:K12)","v":0},7800000]
[]
[]
{"$rows_left_out":74}
{"sheet":"Results","index":4,"n_rows":21,"n_cols":7,"rows_kept":21,"cut":false,"hidden":false,"merged":[[1,0,3,7]]}
[]
["Estimates of investment and operations for IDZ"]
[]
[]
[]
[]
[]
[null,null,"Public funding (total over 20 years)",null,null,"Private investment"]
[null,null,"Total public CAPEX investment",{"$f":"Calculations!V29","v":1908333333.3333321},null,"Total private investment (over 20 years)",{"$f":"Calculations!V30","v":675000000}]
[null,null,"Set up costs (infrastructure)",{"$f":"Calculations!J6","v":1333333333.3333333},null,"Capital Leverage (Rand private investment per Rand public investment)",{"$f":"G9/D9","v":0.35371179039301331}]
[null,null,"Cofunding investors",{"$f":"Calculations!G13","v":575000000},null,"Capital and OPEX leveraga (Rand private investment per Rand public investment)",{"$f":"G9/D16","v":0.18979270559074693}]
[]
[null,null,"Incentives provided",{"$f":"Calculations!W88","v":0}]
[null,null,"Operational shortfall",{"$f":"-Calculations!V84","v":1648178482.5396824},null,"Job creation"]
[null,null,null,null,null,"Permanent jobs created by tenants (direct) over 20 years",{"$f":"Calculations!J13","v":2025}]
{"$rows_left_out":7}
{"sheet":"Scenario analysis","index":5,"n_rows":403,"n_cols":23,"rows_kept":403,"cut":false,"hidden":false,"merged":[[146,0,147,7],[22,2,22,3],[43,0,44,7],[68,0,69,7],[94,0,95,7],[120,0,121,7]]}
[]
[]
[]
[]
[]
[]
[null,"Gross IDZ size",{"$f":"F231","v":10010600}]
[null,"Total lettable area at year 5",{"$f":"F232","v":740000}]
[null,"Total area leased at year 5",{"$f":"F233","v":540000}]
[null,"Area available for leasing",{"$f":"C8-C9","v":200000}]
[]
[null,"% of remaining lettable area leased by Year 20",1]
[null,"Total area leased at year 20",{"$f":"U285","v":740000}]
[]
[null,"Key assumptions for Years 6 - 20"]
{"$rows_left_out":389}
{"sheet":"Coega","index":6,"n_rows":41,"n_cols":23,"rows_kept":41,"cut":false,"hidden":true,"merged":[]}
[null,null,null,null,null,null,null,null,null,null,null,null,null,null,null,null,null,null,"Baseline","Breakeven through rental","Breakeven through opex"]
[null,"Coega",null,null,"Gross IDZ size",111860000,null,"Actual number of tenants on IDZ","Actual tenants","Actual average size (sqm)","Total area leased (sqm)","Tenant investment","IDZ investment","Total investment","Rental income","Jobs created",null,"Total public CAPEX investment",{"$f":"U31","v":11864685000},{"$f":"S2","v":11864685000},{"$f":"T2","v":11864685000}]
[null,"Funding received to date",null,null,"Bulk infrastructure added",7200000,null,"Anchor",12,500000,6000000,6000000000,3000000000,9000000000,600000000,18000,null,"Total public Operational funding",{"$f":"-V23+C5","v":8014377000},{"$f":"-V36+C5","v":3417821669.7587814},{"$f":"-V41+C5","v":5699768199.235383}]
[null,"DTI",4364685000,null,"Total area leased",200000,null,"Medium",20,25000,500000,2000000000,2000000000,4000000000,50000000,6000,null,"Total private investment",{"$f":"U30","v":11783750000},{"$f":"S4","v":11783750000},{"$f":"T4","v":11783750000}]
[null,"Provincial",1517776000,null,"Total direct jobs created",3854,null,"Small",100,5000,500000,2500000000,2500000000,5000000000,50000000,7500,null,"Total jobs created",{"$f":"P6+F5","v":35354},{"$f":"S5","v":35354},{"$f":"T5","v":35354}]
[null,"Private investment",1283750000,null,null,null,null,"Total",null,null,7000000,10500000000,7500000000,18000000000,700000000,31500,null,"Annual public funding per job",{"$f":"((S2+S3)/S5)/20","v":28114.303897720201},{"$f":"((T2+T3)/T5)/20","v":21613.546797758077},24840.828759454915]
[null,null,null,null,null,null,null,null,null,null,null,null,null,null,null,null,null,"Rental and service rate (R/sqm)",{"$f":"U20/F3","v":139.78208333333333},{"$f":"U34/F3","v":202.79569444444445}]
[null,null,null,null,null,null,null,null,null,null,null,null,null,null,null,null,null,"OPEX reduction by year 20",null,null,{"$f":"U39/U18-1","v":-0.31072460036065308}]
[]
[null,"Actual",null,null,null,null,"Forecast"]
[null,1,2,3,4,5,6,7,8,9,10,11,12,13,14,15,16,17,18,19,20,"Total"]
["Staff costs",90412000,95238000,102606000,143975000,141081053,157540509.18333334,173999965.36666667,190459421.55000001,206918877.73333335,223378333.91666669,239837790.10000002,256297246.28333336,272756702.4666667,289216158.65000004,305675614.83333331,322135071.01666665,338594527.20000005,355053983.38333338,371513439.56666666,387972895.75,{"$f":"SUM(B12:U12)","v":4664662590}]
["Travel and accommodation",9248520,13093980,12004770,11850150,15928680,17787026,19645372,21503718,23362064,25220410,27078756,28937102,30795448,32653794,34512140,36370486,38228832,40087178,41945524,43803870,{"$f":"SUM(B13:U13)","v":524057820}]
["Marketing",15414200,21823300,20007950,19750250,26547800,29645043.333333336,32742286.666666668,35839530,38936773.333333336,42034016.666666664,45131260,48228503.333333328,51325746.666666672,54422990,57520233.333333328,60617476.666666664,63714720,66811963.333333336,69909206.666666657,73006450,873429700]
["Property rates",6165680,8729320,8003180,7900100,10619120,11858017.333333334,13096914.666666666,14335812,15574709.333333332,16813606.666666664,18052504,19291401.333333336,20530298.666666664,21769196,23008093.333333332,24246990.666666664,25485888,26724785.333333336,27963682.666666668,29202580,349371880]
{"$rows_left_out":27}
{"sheet":"East London","index":7,"n_rows":41,"n_cols":23,"rows_kept":41,"cut":false,"hidden":true,"merged":[]}
[null,null,null,null,null,null,null,null,null,null,null,null,null,null,null,null,null,null,"Baseline","Breakeven through rental","Breakeven through opex"]
[null,"East London",null,null,"Gross IDZ size",15000000,null,"Actual number of tenants on IDZ","Actual tenants","Actual average size (sqm)","Total area leased (sqm)","Tenant investment","IDZ investment","Total investment","Rental income","Jobs created",null,"Total public CAPEX investment",{"$f":"U31","v":4515728999.999999},{"$f":"S2","v":4515728999.999999},{"$f":"T2","v":4515728999.999999}]
[null,"Funding received to date",null,null,"Bulk infrastructure added",4400000,null,"Anchor",8,500000,4000000,4000000000,2000000000,6000000000,400000000,12000,null,"Total public Operational funding",{"$f":"-V23+C5","v":2744831242.5142498},{"$f":"-V36+C5","v":2919028418.8974237},{"$f":"-V41+C5","v":3168047751.6891289}]
[null,"DTI",1453184000,null,"Total area leased",137491,null,"Medium",10,25000,250000,1000000000,1000000000,2000000000,25000000,3000,null,"Total private investment",{"$f":"U30","v":6145245000},{"$f":"S4","v":6145245000},{"$f":"T4","v":6145245000}]
[null,"Provincial",1464994000,null,"Total direct jobs created",2500,null,"Small",2.5017999999999998,5000,12508.999999999998,62544999.999999993,62544999.999999993,125089999.99999999,1250899.9999999998,187.63499999999999,null,"Total jobs created",{"$f":"P6+F5","v":17687.635000000002},{"$f":"S5","v":17687.635000000002},{"$f":"T5","v":17687.635000000002}]
[null,"Private investment",1082700000,null,null,null,null,"Total",null,null,4262509,5062545000,3062545000,8125090000,426250900,15187.635,null,"Annual public funding per job",{"$f":"((S2+S3)/S5)/20","v":20524.395269673554},{"$f":"((T2+T3)/T5)/20","v":21016.821691813013},21720.757895810057]
[null,null,null,null,null,null,null,null,null,null,null,null,null,null,null,null,null,"Rental and service rate (R/sqm)",{"$f":"U20/F3","v":104.50562295454546},{"$f":"U34/F3","v":98.661120870378042}]
[null,null,null,null,null,null,null,null,null,null,null,null,null,null,null,null,null,"OPEX reduction by year 20",null,null,{"$f":"U39/U18-1","v":5.9238148042590977E-2}]
[]
[null,"Actual",null,null,null,null,"Forecast"]
[null,1,2,3,4,5,6,7,8,9,10,11,12,13,14,15,16,17,18,19,20,"Total"]
["Staff costs",26574065,32179050,36895363,43478919,54467671,60096377.311601952,65725083.623203903,71353789.934805855,76982496.246407807,82611202.558009744,88239908.869611695,93868615.181213647,99497321.492815584,105126027.80441754,110754734.11601949,116383440.42762142,122012146.73922339,127640853.05082534,133269559.36242728,138898265.67402923,{"$f":"SUM(B12:U12)","v":1686054890.3922338}]
["Travel and accommodation",3814762,3537897,3298949,3265703,4025644,4441655.321487613,4857666.6429752251,5273677.9644628381,5689689.2859504502,6105700.6074380632,6521711.9289256763,6937723.2504132884,7353734.5719009005,7769745.8933885135,8185757.2148761246,8601768.5363637377,9017779.8578513507,9433791.1793389637,9849802.5008265767,10265813.822314188,{"$f":"SUM(B13:U13)","v":128248973.57851353}]
["Marketing",4168707,2595796,5814404,6193470,6986267,7708230.036705506,8430193.0734110121,9152156.1101165172,9874119.1468220223,10596082.183527529,11318045.220233034,12040008.256938539,12761971.293644045,13483934.33034955,14205897.367055055,14927860.40376056,15649823.440466067,16371786.477171574,17093749.513877079,17815712.550582584,217188213.40466064]
["Property rates",2422884,2682483,2298632,7746650,4046876,4465081.4430686133,4883286.8861372266,5301492.329205839,5719697.7722744523,6137903.2153430656,6556108.6584116779,6974314.1014802903,7392519.5445489045,7810724.9876175169,8228930.4306861302,8647135.8737547435,9065341.3168233559,9483546.7598919682,9901752.2029605806,10319957.646029195,130085318.16823354]
{"$rows_left_out":27}
{"sheet":"Richards Bay","index":8,"n_rows":41,"n_cols":23,"rows_kept":41,"cut":false,"hidden":true,"merged":[]}
[null,null,null,null,null,null,null,null,null,null,null,null,null,null,null,null,null,null,"Baseline","Breakeven through rental","Breakeven through opex"]
[null,"Richards Bay",null,null,"Gross IDZ size",10010600,null,"Actual number of tenants on IDZ","Actual tenants","Actual average size (sqm)","Total area leased (sqm)","Tenant investment","IDZ investment","Total investment","Rental income","Jobs created",null,"Total public CAPEX investment",{"$f":"U31","v":1091123000},{"$f":"S2","v":1091123000},{"$f":"T2","v":1091123000}]
[null,"Funding received to date",null,null,"Bulk infrastructure added",740000,null,"Anchor",0,500000,0,0,0,0,0,0,null,"Total public Operational funding",{"$f":"-V23+C5","v":886577909.29629648},{"$f":"-V36+C5","v":728262753},{"$f":"-V41+C5","v":728600359.98395085}]
[null,"DTI",191123000,null,"Total area leased",540000,null,"Medium",4,25000,100000,400000000,400000000,800000000,10000000,1200,null,"Total private investment",{"$f":"U30","v":1700000000},{"$f":"S4","v":1700000000},{"$f":"T4","v":1700000000}]
[null,"Provincial",345979000,null,"Total direct jobs created",180,null,"Small",20,5000,100000,500000000,500000000,1000000000,10000000,1500,null,"Total jobs created",{"$f":"P6+F5","v":2880},{"$f":"S5","v":2880},{"$f":"T5","v":2880}]
[null,"Private investment",800000000,null,null,null,null,"Total",null,null,200000,900000000,900000000,1800000000,20000000,2700,null,"Annual public funding per job",{"$f":"((S2+S3)/S5)/20","v":34335.085230838486},{"$f":"((T2+T3)/T5)/20","v":31586.558211805554},31592.419444165815]
[null,null,null,null,null,null,null,null,null,null,null,null,null,null,null,null,null,"Rental and service rate (R/sqm)",{"$f":"U20/F3","v":27.027027027027032},{"$f":"U34/F3","v":53.769452077077077}]
[null,null,null,null,null,null,null,null,null,null,null,null,null,null,null,null,null,"OPEX reduction by year 20",null,null,{"$f":"U39/U18-1","v":-0.49735349751594071}]
[]
[null,"Actual",null,null,null,null,"Forecast"]
[null,1,2,3,4,5,6,7,8,9,10,11,12,13,14,15,16,17,18,19,20,"Total"]
["Staff costs",3815643,4768149,12659122,19163358,19921643,19946237.620987657,19970832.241975311,19995426.862962965,20020021.483950619,20044616.104938272,20069210.725925926,20093805.346913584,20118399.967901237,20142994.588888891,20167589.209876545,20192183.830864199,20216778.451851852,20241373.072839506,20265967.693827163,20290562.314814817,{"$f":"SUM(B12:U12)","v":362103914.51851845}]
["Travel and accommodation",193918,0,815689,1658532,1681281,1683356.6555555556,1685432.311111111,1687507.9666666666,1689583.6222222222,1691659.2777777778,1693734.9333333333,1695810.5888888889,1697886.2444444443,1699961.9,1702037.5555555555,1704113.2111111111,1706188.8666666667,1708264.5222222223,1710340.1777777777,1712415.8333333333,29817713.666666664]
["Marketing",176213,565794,346550,767775,1112064,1113436.9185185186,1114809.8370370371,1116182.7555555557,1117555.674074074,1118928.5925925926,1120301.5111111111,1121674.4296296297,1123047.3481481483,1124420.2666666666,1125793.1851851852,1127166.1037037037,1128539.0222222223,1129911.9407407409,1131284.8592592594,1132657.7777777778,19814106.22222222]
["Property rates",0,724442,1357632,1529683,1732316,1734454.6617283949,1736593.3234567901,1738731.9851851852,1740870.6469135801,1743009.3086419753,1745147.9703703704,1747286.6320987653,1749425.2938271605,1751563.9555555554,1753702.6172839506,1755841.2790123457,1757979.9407407406,1760118.6024691358,1762257.2641975309,1764395.9259259258,31585452.40740741]
{"$rows_left_out":26}